{"text_format":"1","workbook":"xlsx","n_sheets":7,"sheets":["Inicio","Foco de análisis","Nivel de madurez","Matriz","Matriz de procesos-Gráfica","Brechas","Variables"],"not_rendered":{"charts":4,"images":3,"macros":1,"external_links":0,"defined_names":13,"comments":0,"pivot_tables":0},"unopened":[],"bounds":{"document_bytes":16777216,"sheet_cells":100000,"rows_first":2000,"rows_last":500,"rows_between":2000,"halvings":0,"cell_chars":16384,"cell_head_chars":4096},"cells_cut":0,"cells_raw":0,"read":"whole","date_system":"1900"}

{"sheet":"Inicio","index":0,"n_rows":25,"n_cols":2,"rows_kept":25,"cut":false,"hidden":false,"merged":[[2,1,2,11],[18,1,18,11],[19,1,20,11],[24,1,29,11],[11,1,14,11]]}
[]
[]
[null,"UNIVERSIDAD DEL ROSARIO "]
[]
[]
[]
[]
[]
{"$rows_left_out":18}
{"sheet":"Foco de análisis","index":1,"n_rows":30,"n_cols":4,"rows_kept":30,"cut":false,"hidden":false,"merged":[[29,1,37,3],[1,1,1,3],[20,1,20,3],[3,1,3,3],[5,1,8,1],[9,1,10,1],[9,2,10,2],[11,1,15,1],[17,1,17,3],[18,1,18,3]]}
[]
[null,"FOCO DE ANALISIS"]
[]
[null,"SITUACIÓN ACTUAL /OPORTUNIDADES DE MEJORA"]
[null,"Categoría","Estado Actual","Estado Objetivo"]
[null,"Estrategia","1.    Poca alineación de TI con los negocios.","1.   Alineación de la estrategia de TI con la estrategia de negocio."]
[null,null,"2.    Plan estratégico de TI con visión a dos años y vigente hasta el 2014.","2.   Plan estratégico de TI con visión mínima a tres años."]
[null,null,"3.    Foco en la implementación de soluciones tecnológicas.","3.   Iniciativas que mejoren el gobierno, los procesos, la compañía, el talento humano y la arquitectura de tecnología."]
{"$rows_left_out":23}
{"sheet":"Nivel de madurez","index":2,"n_rows":39,"n_cols":6,"rows_kept":39,"cut":false,"hidden":false,"merged":[[0,0,0,5]]}
["NIVEL DE MADUREZ DE LOS PROCESOS DE COBIT"]
["DOMINIO","PROCESO","NOMBRE PROCESO","PROPOSITO","NIVEL ACTUAL ","NIVEL OBJETIVO"]
["APO","APO01","APO01 Gestionar el marco de Gestión de TI","Proporcionar un enfoque de gestión consistente que permita cumplir los requisitos de gobierno corporativo e incluya procesos de gestión, estructuras, roles y responsabilidades organizativos, actividades fiables y reproducibles y habilidades y competencias.",0,2]
["APO","APO02","APO02 Gestionar la estrategia","Alinear los planes estratégicos de TI con los objetivos del negocio. Comunicar claramente los objetivos y las cuentas asociadas para que sean\ncomprendidos por todos, con la identificación de las opciones estratégicas de TI, estructurados e integrados con los planes de negocio.",0,2]
["APO","APO03","APO03 Gestionar la Arquitectura Empresarial","Representar a los diferentes módulos que componen la empresa y sus interrelaciones, así como los principios rectores de su diseño y evolución en el tiempo, permitiendo una entrega estándar, sensible y eficiente de los objetivos operativos y estratégicos.",0,1]
["APO","APO04","APO04 Gestionar la Innovación","Lograr ventaja competitiva, innovación empresarial y eficacia y eficiencia operativa mejorada mediante la explotación de los desarrollos tecnológicos para la explotación de la información.",0,1]
["APO","APO05","APO05 Gestionar portafolio","Optimizar el rendimiento del portafolio global de programas en respuesta al rendimiento de programas y servicios y a las cambiantes prioridades y demandas corporativas",0,2]
["APO","APO06","APO06 Gestionar el presupuesto y los costes","Fomentar la colaboración entre TI y las partes interesadas de la empresa para catalizar el uso eficaz y eficiente de los recursos relacionados con las TI y brindar transparencia y responsabilidad sobre el coste y valor de negocio de soluciones y servicios. Permitir a la empresa tomar decisiones informadas con respecto a la utilización de soluciones y servicios de TI.",2,5]
{"$rows_left_out":32}
{"sheet":"Matriz","index":3,"n_rows":47,"n_cols":21,"rows_kept":47,"cut":false,"hidden":false,"merged":[[0,10,0,13],[0,5,0,9],[0,14,0,19],[0,0,0,4]]}
["INFORMACIÓN BASE DEL PROCESO",null,null,null,null,"NIVEL DE APORTE",null,null,null,null,"NIVEL DE IMPORTANCIA",null,null,null,"NIVEL DE ESFUERZO",null,null,null,null,null,"CLASIFICACION"]
["DOMINIO","PROCESO","NOMBRE PROCESO","PROPOSITO","NIVEL ACTUAL COBIT ","APORTE AL FOCO SEGÚN PROPOSITO","PESO DEL APORTE AL FOCO","NUMERO DE PRACTICAS","PESO SEGUN NUMERO DE PRACTICAS","NIVEL DE APORTE","JUICIO EXPERTO NI","PESO POR DOMINIO","PESO POR EXPERTO","VALOR IMPORTANCIA","JUICIO EXPERTO NE","PESO POR JUICIO EXPERTOS","PESO POR PRACTICAS","VALOR POR ESFUERZO","TAMAÑO E","NIVEL OBJETIVO COBIT","CUADRANTE"]
["APO","APO01","APO01 Gestionar el marco de gestión de TI","Proporcionar un enfoque de gestión consistente que permita cumplir los requisitos de gobierno corporativo e incluya procesos de gestión, estructuras, roles y responsabilidades organizativos, actividades fiables y reproducibles y habilidades y competencias.",{"$f":"'Nivel de madurez'!E3","v":0},"DIRECTO",{"$f":"VLOOKUP(Tabla1[[#This Row],[APORTE AL FOCO SEGÚN PROPOSITO]],Variables!$E$13:$F$15,2,1)","v":10},8,{"$f":"IF(Tabla1[[#This Row],[NUMERO DE PRACTICAS]]<=4,Variables!$F$18,IF(Tabla1[[#This Row],[NUMERO DE PRACTICAS]]<=7,Variables!$F$17,Variables!$F$16))","v":8},{"$f":"Tabla1[[#This Row],[PESO DEL APORTE AL FOCO]]*Variables!$D$13+Tabla1[[#This Row],[PESO SEGUN NUMERO DE PRACTICAS]]*Variables!$D$16","v":9.1999999999999993},"ALTO",{"$f":"VLOOKUP(Tabla1[[#This Row],[DOMINIO]],Variables!$E$4:$F$8,2,1)","v":10},{"$f":"VLOOKUP(Tabla1[[#This Row],[JUICIO EXPERTO NI]],Variables!$E$9:$F$11,2,1)","v":9},{"$f":"Tabla1[[#This Row],[PESO POR DOMINIO]]*Variables!$D$4+Tabla1[[#This Row],[PESO POR EXPERTO]]*Variables!$D$9","v":9.5},"ALTO",{"$f":"VLOOKUP(Tabla1[[#This Row],[JUICIO EXPERTO NE]],Variables!$E$20:$F$22,2,1)","v":10},{"$f":"IF(Tabla1[[#This Row],[NUMERO DE PRACTICAS]]<=4,Variables!$F$25,IF(Tabla1[[#This Row],[NUMERO DE PRACTICAS]]<=7,Variables!$F$24,Variables!$F$23))","v":8},{"$f":"Tabla1[[#This Row],[PESO POR JUICIO EXPERTOS]]*Variables!$D$20+Tabla1[[#This Row],[PESO POR PRACTICAS]]*Variables!$D$23","v":9.1999999999999993},{"$f":"Tabla1[[#This Row],[VALOR POR ESFUERZO]]/100","v":9.1999999999999998E-2},{"$f":"'Nivel de madurez'!F3","v":2},1]
["APO","APO02","APO02 Gestionar la estrategia","Alinear los planes estratégicos de TI con los objetivos del negocio. Comunicar claramente los objetivos y las cuentas asociadas para que sean\ncomprendidos por todos, con la identificación de las opciones estratégicas de TI, estructurados e integrados con los planes de negocio.",{"$f":"'Nivel de madurez'!E4","v":0},"DIRECTO",{"$f":"VLOOKUP(Tabla1[[#This Row],[APORTE AL FOCO SEGÚN PROPOSITO]],Variables!$E$13:$F$15,2,1)","v":10},6,{"$f":"IF(Tabla1[[#This Row],[NUMERO DE PRACTICAS]]<=4,Variables!$F$18,IF(Tabla1[[#This Row],[NUMERO DE PRACTICAS]]<=7,Variables!$F$17,Variables!$F$16))","v":4},{"$f":"Tabla1[[#This Row],[PESO DEL APORTE AL FOCO]]*Variables!$D$13+Tabla1[[#This Row],[PESO SEGUN NUMERO DE PRACTICAS]]*Variables!$D$16","v":7.6},"ALTO",{"$f":"VLOOKUP(Tabla1[[#This Row],[DOMINIO]],Variables!$E$4:$F$8,2,1)","v":10},{"$f":"VLOOKUP(Tabla1[[#This Row],[JUICIO EXPERTO NI]],Variables!$E$9:$F$11,2,1)","v":9},{"$f":"Tabla1[[#This Row],[PESO POR DOMINIO]]*Variables!$D$4+Tabla1[[#This Row],[PESO POR EXPERTO]]*Variables!$D$9","v":9.5},"ALTO",{"$f":"VLOOKUP(Tabla1[[#This Row],[JUICIO EXPERTO NE]],Variables!$E$20:$F$22,2,1)","v":10},{"$f":"IF(Tabla1[[#This Row],[NUMERO DE PRACTICAS]]<=4,Variables!$F$25,IF(Tabla1[[#This Row],[NUMERO DE PRACTICAS]]<=7,Variables!$F$24,Variables!$F$23))","v":4},{"$f":"Tabla1[[#This Row],[PESO POR JUICIO EXPERTOS]]*Variables!$D$20+Tabla1[[#This Row],[PESO POR PRACTICAS]]*Variables!$D$23","v":7.6},{"$f":"Tabla1[[#This Row],[VALOR POR ESFUERZO]]/100","v":7.5999999999999998E-2},{"$f":"'Nivel de madurez'!F4","v":2},1]
["APO","APO03","APO03 Gestionar la arquitectura empresarial","Representar a los diferentes módulos que componen la empresa y sus interrelaciones, así como los principios rectores de su diseño y evolución en el tiempo, permitiendo una entrega estándar, sensible y eficiente de los objetivos operativos y estratégicos.",{"$f":"'Nivel de madurez'!E5","v":0},"INDIRECTO",{"$f":"VLOOKUP(Tabla1[[#This Row],[APORTE AL FOCO SEGÚN PROPOSITO]],Variables!$E$13:$F$15,2,1)","v":6},5,{"$f":"IF(Tabla1[[#This Row],[NUMERO DE PRACTICAS]]<=4,Variables!$F$18,IF(Tabla1[[#This Row],[NUMERO DE PRACTICAS]]<=7,Variables!$F$17,Variables!$F$16))","v":4},{"$f":"Tabla1[[#This Row],[PESO DEL APORTE AL FOCO]]*Variables!$D$13+Tabla1[[#This Row],[PESO SEGUN NUMERO DE PRACTICAS]]*Variables!$D$16","v":5.1999999999999993},"ALTO",{"$f":"VLOOKUP(Tabla1[[#This Row],[DOMINIO]],Variables!$E$4:$F$8,2,1)","v":10},{"$f":"VLOOKUP(Tabla1[[#This Row],[JUICIO EXPERTO NI]],Variables!$E$9:$F$11,2,1)","v":9},{"$f":"Tabla1[[#This Row],[PESO POR DOMINIO]]*Variables!$D$4+Tabla1[[#This Row],[PESO POR EXPERTO]]*Variables!$D$9","v":9.5},"ALTO",{"$f":"VLOOKUP(Tabla1[[#This Row],[JUICIO EXPERTO NE]],Variables!$E$20:$F$22,2,1)","v":10},{"$f":"IF(Tabla1[[#This Row],[NUMERO DE PRACTICAS]]<=4,Variables!$F$25,IF(Tabla1[[#This Row],[NUMERO DE PRACTICAS]]<=7,Variables!$F$24,Variables!$F$23))","v":4},{"$f":"Tabla1[[#This Row],[PESO POR JUICIO EXPERTOS]]*Variables!$D$20+Tabla1[[#This Row],[PESO POR PRACTICAS]]*Variables!$D$23","v":7.6},{"$f":"Tabla1[[#This Row],[VALOR POR ESFUERZO]]/100","v":7.5999999999999998E-2},{"$f":"'Nivel de madurez'!F5","v":1},1]
["APO","APO04","APO04 Gestionar la innovación","Lograr ventaja competitiva, innovación empresarial y eficacia y eficiencia operativa mejorada mediante la explotación de los desarrollos tecnológicos para la explotación de la información.",{"$f":"'Nivel de madurez'!E6","v":0},"INDIRECTO",{"$f":"VLOOKUP(Tabla1[[#This Row],[APORTE AL FOCO SEGÚN PROPOSITO]],Variables!$E$13:$F$15,2,1)","v":6},6,{"$f":"IF(Tabla1[[#This Row],[NUMERO DE PRACTICAS]]<=4,Variables!$F$18,IF(Tabla1[[#This Row],[NUMERO DE PRACTICAS]]<=7,Variables!$F$17,Variables!$F$16))","v":4},{"$f":"Tabla1[[#This Row],[PESO DEL APORTE AL FOCO]]*Variables!$D$13+Tabla1[[#This Row],[PESO SEGUN NUMERO DE PRACTICAS]]*Variables!$D$16","v":5.1999999999999993},"MEDIO",{"$f":"VLOOKUP(Tabla1[[#This Row],[DOMINIO]],Variables!$E$4:$F$8,2,1)","v":10},{"$f":"VLOOKUP(Tabla1[[#This Row],[JUICIO EXPERTO NI]],Variables!$E$9:$F$11,2,1)","v":5},{"$f":"Tabla1[[#This Row],[PESO POR DOMINIO]]*Variables!$D$4+Tabla1[[#This Row],[PESO POR EXPERTO]]*Variables!$D$9","v":7.5},"ALTO",{"$f":"VLOOKUP(Tabla1[[#This Row],[JUICIO EXPERTO NE]],Variables!$E$20:$F$22,2,1)","v":10},{"$f":"IF(Tabla1[[#This Row],[NUMERO DE PRACTICAS]]<=4,Variables!$F$25,IF(Tabla1[[#This Row],[NUMERO DE PRACTICAS]]<=7,Variables!$F$24,Variables!$F$23))","v":4},{"$f":"Tabla1[[#This Row],[PESO POR JUICIO EXPERTOS]]*Variables!$D$20+Tabla1[[#This Row],[PESO POR PRACTICAS]]*Variables!$D$23","v":7.6},{"$f":"Tabla1[[#This Row],[VALOR POR ESFUERZO]]/100","v":7.5999999999999998E-2},{"$f":"'Nivel de madurez'!F6","v":1},1]
["APO","APO05","APO05 Gestionar portafolio","Optimizar el rendimiento del portafolio global de programas en respuesta al rendimiento de programas y servicios y a las cambiantes prioridades y demandas corporativas",{"$f":"'Nivel de madurez'!E7","v":0},"INDIRECTO",{"$f":"VLOOKUP(Tabla1[[#This Row],[APORTE AL FOCO SEGÚN PROPOSITO]],Variables!$E$13:$F$15,2,1)","v":6},6,{"$f":"IF(Tabla1[[#This Row],[NUMERO DE PRACTICAS]]<=4,Variables!$F$18,IF(Tabla1[[#This Row],[NUMERO DE PRACTICAS]]<=7,Variables!$F$17,Variables!$F$16))","v":4},{"$f":"Tabla1[[#This Row],[PESO DEL APORTE AL FOCO]]*Variables!$D$13+Tabla1[[#This Row],[PESO SEGUN NUMERO DE PRACTICAS]]*Variables!$D$16","v":5.1999999999999993},"MEDIO",{"$f":"VLOOKUP(Tabla1[[#This Row],[DOMINIO]],Variables!$E$4:$F$8,2,1)","v":10},{"$f":"VLOOKUP(Tabla1[[#This Row],[JUICIO EXPERTO NI]],Variables!$E$9:$F$11,2,1)","v":5},{"$f":"Tabla1[[#This Row],[PESO POR DOMINIO]]*Variables!$D$4+Tabla1[[#This Row],[PESO POR EXPERTO]]*Variables!$D$9","v":7.5},"ALTO",{"$f":"VLOOKUP(Tabla1[[#This Row],[JUICIO EXPERTO NE]],Variables!$E$20:$F$22,2,1)","v":10},{"$f":"IF(Tabla1[[#This Row],[NUMERO DE PRACTICAS]]<=4,Variables!$F$25,IF(Tabla1[[#This Row],[NUMERO DE PRACTICAS]]<=7,Variables!$F$24,Variables!$F$23))","v":4},{"$f":"Tabla1[[#This Row],[PESO POR JUICIO EXPERTOS]]*Variables!$D$20+Tabla1[[#This Row],[PESO POR PRACTICAS]]*Variables!$D$23","v":7.6},{"$f":"Tabla1[[#This Row],[VALOR POR ESFUERZO]]/100","v":7.5999999999999998E-2},{"$f":"'Nivel de madurez'!F7","v":2},1]
["APO","APO06","APO06 Gestionar el presupuesto y los costes","Fomentar la colaboración entre TI y las partes interesadas de la empresa para catalizar el uso eficaz y eficiente de los recursos relacionados con las TI y brindar transparencia y responsabilidad sobre el coste y valor de negocio de soluciones y servicios. Permitir a la empresa tomar decisiones informadas con respecto a la utilización de soluciones y servicios de TI.",{"$f":"'Nivel de madurez'!E8","v":2},"INDIRECTO",{"$f":"VLOOKUP(Tabla1[[#This Row],[APORTE AL FOCO SEGÚN PROPOSITO]],Variables!$E$13:$F$15,2,1)","v":6},5,{"$f":"IF(Tabla1[[#This Row],[NUMERO DE PRACTICAS]]<=4,Variables!$F$18,IF(Tabla1[[#This Row],[NUMERO DE PRACTICAS]]<=7,Variables!$F$17,Variables!$F$16))","v":4},{"$f":"Tabla1[[#This Row],[PESO DEL APORTE AL FOCO]]*Variables!$D$13+Tabla1[[#This Row],[PESO SEGUN NUMERO DE PRACTICAS]]*Variables!$D$16","v":5.1999999999999993},"BAJO",{"$f":"VLOOKUP(Tabla1[[#This Row],[DOMINIO]],Variables!$E$4:$F$8,2,1)","v":10},{"$f":"VLOOKUP(Tabla1[[#This Row],[JUICIO EXPERTO NI]],Variables!$E$9:$F$11,2,1)","v":2},{"$f":"Tabla1[[#This Row],[PESO POR DOMINIO]]*Variables!$D$4+Tabla1[[#This Row],[PESO POR EXPERTO]]*Variables!$D$9","v":6},"MEDIO",{"$f":"VLOOKUP(Tabla1[[#This Row],[JUICIO EXPERTO NE]],Variables!$E$20:$F$22,2,1)","v":5},{"$f":"IF(Tabla1[[#This Row],[NUMERO DE PRACTICAS]]<=4,Variables!$F$25,IF(Tabla1[[#This Row],[NUMERO DE PRACTICAS]]<=7,Variables!$F$24,Variables!$F$23))","v":4},{"$f":"Tabla1[[#This Row],[PESO POR JUICIO EXPERTOS]]*Variables!$D$20+Tabla1[[#This Row],[PESO POR PRACTICAS]]*Variables!$D$23","v":4.5999999999999996},{"$f":"Tabla1[[#This Row],[VALOR POR ESFUERZO]]/100","v":4.5999999999999999E-2},{"$f":"'Nivel de madurez'!F8","v":5},1]
{"$rows_left_out":40}
{"sheet":"Matriz de procesos-Gráfica","index":4,"n_rows":52,"n_cols":16,"rows_kept":52,"cut":false,"hidden":false,"merged":[[1,1,1,18],[3,15,22,17],[41,10,42,11],[41,12,42,13],[43,10,44,11],[43,12,44,13],[41,3,42,4],[43,3,44,4],[41,5,42,6],[43,5,44,6]]}
[]
[null,"MATRIZ DE CLASIFICACIÓN Y PRIORIZACIÓN DE PROCESOS COBIT"]
[]
[null,null,null,null,null,null,null,null,null,null,null,null,null,null,null,"Instrucciones:\n\n1. Verifique que el nivel de madurez esté completamente diligenciado (hoja Nivel de madurez).\n\n2. Para borrar la clasificación de la gráfica actual, presione el botón <<Borrar clasificación>>.\n\n3. Para generar una nueva gráfica de la clasificación, presione el botón <<Generar clasificación>>.\n\n4. Puede realizar los filtros en la Matriz de los procesos (hoja Matriz) y visualizar los cambios de manera automática."]
[]
[]
[]
[]
{"$rows_left_out":45}
{"sheet":"Brechas","index":5,"n_rows":18,"n_cols":12,"rows_kept":18,"cut":false,"hidden":false,"merged":[]}
[null,"Dominio","Proceso ","Nombre del Proceso","Código de práctica de Gestión","Nombre de Práctica de Gestión","Descripción de la práctica","Salidas de la práctica","Entregables","Apoyo al nivel de capacidad","Tipo de entregable","Responsable"]
[null,"APO","APO01","Gestionar el marco de Gestión de TI","APO01.01","Definir la estructura organizativa","Establecer una estructura organizativa interna y extensa que refleje las necesidades del negocio y las prioridades de TI. Implementar las estructuras de gestión requeridas (p. ej., comités) para permitir que la toma de decisiones se lleve a cabo de la forma más eficaz y eficiente posible.","1. Estructura organizacional: Definición de estructura y funciones organizativas\n2. Estructura de control de gestión: Directrices operativas de la organización\n3. Plan de comunicación: Reglas básicas de comunicación","1. Modelo de gobierno de TI:\n1.1 Misión de TI\n1.2 Visión de TI\n1.3 Valores de TI\n1.4 Focos estratégicos de TI \n1.5 Estructura de TI\n1.6 Roles y Responsabilidades\n1.7 Estructura de control de gestión (comités y reuniones de TI)\n1.8 Plan de comunicaciones\n1.10 Mapa de procesos de Tecnología: validar en donde esta la definición de los procesos de COBIT, debería quedar dentro de \"formular la estrategia\" con el fin de que se reflejen los procesos \n1.11 Modelo operativo: forma de operar de la TI (federado, hibrido, centralizado o descentralizado)",1,"Requerido","Jefe de RH\nJefe de TI"]
[null,"APO","APO01","Gestionar el marco de Gestión de TI","APO01.02","Establecer roles y responsabilidades","Establecer, acordar y comunicar roles y responsabilidades del personal de TI, así como de otras partes interesadas con responsabilidades en las TI corporativas, que reflejen claramente las necesidades generales del negocio y los objetivos de TI, así como la autoridad, las responsabilidades y la rendición de cuentas del personal relevante.","1. Roles y responsabilidades: Definición de roles y responsabilidades relativos a TI\n2. Manual de delegación: Definición de prácticas de supervisión","1. Modelo de gobierno de TI:\n1.6 Roles y Responsabilidades\n1.9 Manual de delegación",1,"Requerido","Jefe de TI"]
[null,"APO","APO01","Gestionar el marco de Gestión de TI","APO01.03","Mantener los elementos catalizadores del sistema de gestión","Mantener los elementos catalizadores del sistema de gestión y del entorno de control de la TI de la empresa y garantizar que están integrados y alineados con la filosofía y el estilo operativo de gobierno y de gestión de la empresa. Estos elementos catalizadores incluyen una comunicación clara de expectativas/requisitos. El sistema de gestión debería fomentar la cooperación interdepartamental y el trabajo en equipo, promover el cumplimiento y la mejora continua y tratar las desviaciones en el proceso (incluidos los fallos).","1.Politicas de TI: Políticas relativas a TI","1. Políticas de TI: listar los documentos existentes\n- coso\n- Seguridad de la información\n- Uso de activos\n- Controles internos\n- Propiedad intelectual \n- Tratamiento de datos personales\n- Cada política debe especificar que se revise una vez al año como mínimo\n2. Gestión de controles: validar con gisella como se esta llevando a cabo y donde esta este procedimiento establecido. Debe tener una periocidad definida, evidencia solicitada, ubicación de la información, acciones definidadas en caso de no cumplimiento",2,"Sugerido","Director de Operaciones (COO)\nDirector de Informática/Sistemas (CIO)"]
[null,"APO","APO01","Gestionar el marco de Gestión de TI","APO01.04","Comunicar los objetivos y la dirección de gestión","Comunicar la sensibilización y la comprensión de los objetivos y la dirección de TI a las partes interesadas y usuarios pertinentes a lo largo de toda la empresa.","1. Plan de comunicaciones: Comunicación de objetivos de TI","1. Ejecución plan de comunicación\n- Material de comunicación\n- Evidencias de ejecución de las comunicaciones\n- Ubicación de la documentación recolectada",2,"Sugerido","Director General Financiero (CFO)\nDirector de Operaciones (COO)\nEjecutivos de Negocio\nComité Ejecutivo Estratégico\nDirector de Riesgos (CRO)\nDirector de Seguridad de la Información (CISO)\nDirector de Informática/Sistemas (CIO)"]
[null,"APO","APO01","Gestionar el marco de Gestión de TI","APO01.05","Optimizar la ubicación de la función de TI","Posicionar la capacidad de TI en la estructura organizativa global para reflejar en el modelo de empresa la importancia de TI en la organización, especialmente su criticidad para la estrategia empresarial y el nivel de dependencia de TI. La línea de reporte del CIO debe ser proporcional a la importancia de las TI en la empresa","1. Análisis estratégico de TI: Evaluación de las opciones para la organización de TI\n2. Modelo operativo: Definir la función operacional de las funciones de TI","1. Plan estratégico de TI: Pedir el documento del plan estratégico entregado por Everis\n- Como se alinea la TI con la estrategia empresarial\n- Vigencia del plan \n- como se configura el área de TI (modelo operativo)\n- Proceso definido: generar un proceso para generar el PETI. Dentro del mapa de procesos general en la definición de la estrategia el nivel 1 para generar el PETI",3,"Sugerido","Director de Informática/Sistemas (CIO)\nJefe de Administración TI"]
[null,"APO","APO01","Gestionar el marco de Gestión de TI","APO01.06","Definir la propiedad de la información (datos) y del sistema","Definir y mantener las responsabilidades de la propiedad de la información (datos) y los sistemas de información. Asegurar que los propietarios toman decisiones sobre la clasificación de la información y los sistemas y su protección de acuerdo con esta clasificación","1. Tratamiento de los datos: Directrices para la clasificación de datos\n2. Seguridad de información: Directrices para el control y seguridad de datos\n3. Seguridad de la información: Procedimientos de integridad de datos","1. Protección de datos: pedir lo de la consultoría Everis\n- Políticas y directrices\n- Implementación de las políticas y directrices\n- Procedimientos para asegurar la sostenibilidad de la implementación realizada",3,"Sugerido","Propietarios de los Procesos de Negocio"]
[null,"APO","APO01","Gestionar el marco de Gestión de TI","APO01.07","Gestionar la mejora continua de los procesos","Evaluar, planificar y ejecutar la mejora continua de procesos y su madurez para asegurar que son capaces de entregarse conforme a los objetivos de la empresa, de gobierno, de gestión y de control. Considerar las directrices de la implementación de procesos de COBIT, estándares emergentes, requerimientos de cumplimiento, oportunidades de automatización y la realimentación de los usuarios de los procesos, el equipo del proceso y otras partes interesadas. Actualizar los procesos y considerar el impacto en los catalizadores del proceso","1. Capacidad de procesos: Evaluaciones de la capacidad de los procesos\n2. Mejora de procesos: Oportunidades de mejoras de proceso\n3. Rendimiento de procesos: Objetivos y métricas de rendimiento para el seguimiento de la mejora de procesos","1. Análisis de capacidad de procesos de gobierno y gestión de TI: \nRealizar según la vigencia del PETI el análisis de los procesos, donde se evalue el nivel de madurez, identificando las oportunidades de mejora y definiendo el nivel objetivo deseado",5,"Sugerido","Propietarios de los Procesos de Negocio\nOficina de Gestión de Proyectos\nDirector de Informática/Sistemas (CIO)\nJefe de Arquitectura del Negocio\nJefe de Desarrollo\nJefe de Operaciones TI\nJefe de Administración TI\nGestor de Servicio (Service Manager)\nGestor de Seguridad de la Información\nGestor de Continuidad de Negocio"]
{"$rows_left_out":11}
{"sheet":"Variables","index":6,"n_rows":25,"n_cols":6,"rows_kept":25,"cut":false,"hidden":false,"merged":[[1,1,1,5],[19,1,24,1],[19,2,21,2],[19,3,21,3],[22,2,24,2],[22,3,24,3],[3,1,10,1],[3,2,7,2],[3,3,7,3],[8,2,10,2],[8,3,10,3],[12,2,14,2],[15,2,17,2],[12,1,17,1],[12,3,14,3],[15,3,17,3]]}
[]
[null,"VARIABLES BASICAS DEL MODELO"]
[]
[null,"Nivel de importancia del proceso","Relevancia asignada al dominio de procesos",0.5,"APO",{"$f":"'Foco de análisis'!D23","v":10}]
[null,null,null,null,"BAI",{"$f":"'Foco de análisis'!D24","v":7}]
[null,null,null,null,"DSS",{"$f":"'Foco de análisis'!D25","v":3}]
[null,null,null,null,"EDM",{"$f":"'Foco de análisis'!D26","v":5}]
[null,null,null,null,"MEA",{"$f":"'Foco de análisis'!D27","v":1}]
{"$rows_left_out":17}